Target
Aldo-keto reductase family 1 member B1
Ligand
BDBM7459
Substrate
Meas. Tech.
ChEMBL_974574 (CHEMBL2410162)
IC50
600±n/a nM
Citation
 Wang, QQCheng, NZheng, XWPeng, SMZou, XQ Synthesis of organic nitrates of luteolin as a novel class of potent aldose reductase inhibitors. Bioorg Med Chem 21:4301-10 (2013)  
Target
Name:
Aldo-keto reductase family 1 member B1
Synonyms:
AKR1B1 ALDR_HUMAN AR Aldose Reductase (ALR2) Aldose reductase (AR)
Type:
Protein
Mol. Mass.:
35855.50
Organism:
Homo sapiens (Human)
Description:
P15121. 4LAU; 2IKI; 4LB4; 2FZD; 2FZ8; 1US0
Residue:
316
  
Inhibitor
Name:
BDBM7459
Synonyms:
2-(3,4-dihydroxyphenyl)-5,7-dihydroxy-4H-chromen-4-one CHEMBL151 Luteolin (4) cid_5280445 med.21724, Compound 3
Type:
Small organic molecule
Emp. Form.:
C15H10O6
Mol. Mass.:
286.2363
SMILES:
Oc1cc(O)c2c(c1)oc(cc2=O)-c1ccc(O)c(O)c1
: