Target
Neuronal acetylcholine receptor subunit alpha-4/beta-2
Ligand
BDBM50437504
Substrate
Meas. Tech.
ChEMBL_975104 (CHEMBL2412570)
IC50
5.5±n/a nM
Citation
 Zhang, HKYu, LFEaton, JBWhiteaker, POnajole, OKHanania, TBrunner, DLukas, RJKozikowski, AP Chemistry, pharmacology, and behavioral studies identify chiral cyclopropanes as selectivea4ß2-nicotinic acetylcholine receptor partial agonists exhibiting an antidepressant profile. Part II. J Med Chem 56:5495-504 (2014)  
Target
Name:
Neuronal acetylcholine receptor subunit alpha-4/beta-2
Synonyms:
Neuronal acetylcholine receptor Alpha-4/Beta-2 Neuronal acetylcholine receptor; alpha4/beta2 | nAChR subtypes alpha4 beta2
Type:
Protein
Mol. Mass.:
Description:
Components:
This complex has 2 components.
Component 1
Name:
Neuronal acetylcholine receptor subunit alpha-4
Synonyms:
ACHA4_HUMAN CHRNA4 protein Neuronal acetylcholine receptor protein alpha-4 subunit Nicotinic acetylcholine receptor alpha4/beta2/alpha5
Type:
Mol. Mass.:
69963.49
Organism:
Homo sapiens (Human)
Description:
NACHRA4
Residue:
627
  
Component 2
Name:
Neuronal acetylcholine receptor subunit beta-2
Synonyms:
ACHB2_HUMAN Neuronal acetylcholine receptor protein beta-2 subunit | Nicotinic acetylcholine receptor alpha3/beta2/alpha5
Type:
Protein
Mol. Mass.:
57020.50
Organism:
Homo sapiens (Human)
Description:
P17787
Residue:
502
  
Inhibitor
Name:
BDBM50437504
Synonyms:
CHEMBL2409631
Type:
Small organic molecule
Emp. Form.:
C16H24N2O2
Mol. Mass.:
276.374
SMILES:
COCC[C@H]1C[C@@H]1c1cncc(OC[C@@H]2CCNC2)c1
: