Target
Serine/threonine-protein kinase B-raf
Ligand
BDBM50437507
Substrate
Meas. Tech.
ChEMBL_974110 (CHEMBL2410833)
IC50
>1000±n/a nM
Citation
 Oguro, YCary, DRMiyamoto, NTawada, MIwata, HMiki, HHori, AImamura, S Design, synthesis, and evaluation of novel VEGFR2 kinase inhibitors: discovery of [1,2,4]triazolo[1,5-a]pyridine derivatives with slow dissociation kinetics. Bioorg Med Chem 21:4714-29 (2013)  
Target
Name:
Serine/threonine-protein kinase B-raf
Synonyms:
B-RAF B-Raf proto-oncogene serine/threonine-protein kinase BRAF1 RAFB1 v-Raf murine sarcoma viral oncogene homolog B1
Type:
Serine/threonine-protein kinase
Mol. Mass.:
84446.00
Organism:
Homo sapiens (Human)
Description:
P15056
Residue:
766
  
Inhibitor
Name:
BDBM50437507
Synonyms:
CHEMBL2409781
Type:
Small organic molecule
Emp. Form.:
C22H20N6O3S
Mol. Mass.:
448.498
SMILES:
Cc1cc(C(=O)Nc2cccc(Oc3ccc4nc(NC(=O)C5CC5)sc4n3)c2)n(C)n1
: