Target
Platelet-derived growth factor receptor beta
Ligand
BDBM50437509
Substrate
Meas. Tech.
ChEMBL_974115 (CHEMBL2410838)
IC50
19±n/a nM
Citation
 Oguro, YCary, DRMiyamoto, NTawada, MIwata, HMiki, HHori, AImamura, S Design, synthesis, and evaluation of novel VEGFR2 kinase inhibitors: discovery of [1,2,4]triazolo[1,5-a]pyridine derivatives with slow dissociation kinetics. Bioorg Med Chem 21:4714-29 (2013)  
Target
Name:
Platelet-derived growth factor receptor beta
Synonyms:
Beta-type platelet-derived growth factor receptor CD140b antigen PDGF Receptor Substrate PDGFR PDGFR-1 PDGFRB PGFRB_HUMAN Platelet-derived growth factor receptor 1 Platelet-derived growth factor receptor beta (PDGFR-beta) Platelet-derived growth factor receptor beta (PDGFRbeta) | VHL/PDGFRB
Type:
Enzyme
Mol. Mass.:
123922.25
Organism:
Homo sapiens (Human)
Description:
P09619
Residue:
1106
  
Inhibitor
Name:
BDBM50437509
Synonyms:
CHEMBL2409775
Type:
Small organic molecule
Emp. Form.:
C22H21N7O3
Mol. Mass.:
431.4472
SMILES:
Cc1cc(C(=O)Nc2cccc(Oc3ccc4nc(NC(=O)C5CC5)nn4c3)c2)n(C)n1
: