Target
Cathepsin D
Ligand
BDBM50437554
Substrate
Meas. Tech.
ChEMBL_974167 (CHEMBL2411009)
IC50
6.3±n/a nM
Citation
 Pennington, LDWhittington, DABartberger, MDJordan, SRMonenschein, HNguyen, TTYang, BHXue, QMVounatsos, FWahl, RCChen, KWood, SCitron, MPatel, VFHitchcock, SAZhong, W Hydroxyethylamine-based inhibitors of BACE1: P1-P3 macrocyclization can improve potency, selectivity, and cell activity. Bioorg Med Chem Lett 23:4459-64 (2013)  
Target
Name:
Cathepsin D
Synonyms:
CATD_HUMAN CTSD Cathepsin D heavy chain Cathepsin D precursor
Type:
Enzyme
Mol. Mass.:
44551.72
Organism:
Homo sapiens (Human)
Description:
Human proCathepsin D (SwissProt accession number P07339) was expressed in Sf9 cells, purified, and autoactivated.
Residue:
412
  
Inhibitor
Name:
BDBM50437554
Synonyms:
CHEMBL2407496
Type:
Small organic molecule
Emp. Form.:
C33H44N2O3
Mol. Mass.:
516.7141
SMILES:
CCc1ccc2OC3(CCC3)C[C@H](NC[C@@H](O)[C@H](Cc3cccc(CC=C)c3)NC(=O)CCCC=C)c2c1
: