Target
Serine/threonine-protein kinase PLK3
Ligand
BDBM50437843
Substrate
Meas. Tech.
ChEMBL_973990 (CHEMBL2410315)
IC50
>10000±n/a nM
Citation
 Laufer, RForrest, BLi, SWLiu, YSampson, PEdwards, LLang, YAwrey, DEMao, GPlotnikova, OLeung, GHodgson, RBeletskaya, IMason, JMLuo, XWei, XYao, YFeher, MBan, FKiarash, RGreen, EMak, TWPan, GPauls, HW The discovery of PLK4 inhibitors: (E)-3-((1H-Indazol-6-yl)methylene)indolin-2-ones as novel antiproliferative agents. J Med Chem 56:6069-87 (2013)  
Target
Name:
Serine/threonine-protein kinase PLK3
Synonyms:
CNK FGF-inducible kinase PLK3 PRK Proliferation-related kinase | Serine/threonine-protein kinase PLK3
Type:
Serine/threonine-protein kinase
Mol. Mass.:
71655.17
Organism:
Homo sapiens (Human)
Description:
Enzyme assays were using PLK3 purified from baculovirus-infected Trichoplusia ni cells expressing full-length PLK3.
Residue:
646
  
Inhibitor
Name:
BDBM50437843
Synonyms:
CHEMBL2407898
Type:
Small organic molecule
Emp. Form.:
C28H26N4O2
Mol. Mass.:
450.5316
SMILES:
COc1ccc2NC(=O)\C(=C\c3ccc4c(\C=C\c5ccc(CN(C)C)cc5)n[nH]c4c3)c2c1
: