Target
Serine/threonine-protein kinase PLK1
Ligand
BDBM50437844
Substrate
Meas. Tech.
ChEMBL_973991 (CHEMBL2410316)
IC50
>10000±n/a nM
Citation
 Laufer, RForrest, BLi, SWLiu, YSampson, PEdwards, LLang, YAwrey, DEMao, GPlotnikova, OLeung, GHodgson, RBeletskaya, IMason, JMLuo, XWei, XYao, YFeher, MBan, FKiarash, RGreen, EMak, TWPan, GPauls, HW The discovery of PLK4 inhibitors: (E)-3-((1H-Indazol-6-yl)methylene)indolin-2-ones as novel antiproliferative agents. J Med Chem 56:6069-87 (2013)  
Target
Name:
Serine/threonine-protein kinase PLK1
Synonyms:
PLK PLK1 Polo-like kinase 1 (PlK1) STPK13 Serine/threonine-protein kinase 13 | polo-like kinase
Type:
Serine/threonine-protein kinase
Mol. Mass.:
68277.16
Organism:
Homo sapiens (Human)
Description:
P53350
Residue:
603
  
Inhibitor
Name:
BDBM50437844
Synonyms:
CHEMBL2407896
Type:
Small organic molecule
Emp. Form.:
C24H17N3O
Mol. Mass.:
363.4113
SMILES:
O=C1Nc2ccccc2\C1=C/c1ccc2c(\C=C\c3ccccc3)n[nH]c2c1
: