Target
Cytochrome P450 2C9
Ligand
BDBM50437838
Substrate
Meas. Tech.
ChEMBL_973970 (CHEMBL2410117)
IC50
20±n/a nM
Citation
 Laufer, RForrest, BLi, SWLiu, YSampson, PEdwards, LLang, YAwrey, DEMao, GPlotnikova, OLeung, GHodgson, RBeletskaya, IMason, JMLuo, XWei, XYao, YFeher, MBan, FKiarash, RGreen, EMak, TWPan, GPauls, HW The discovery of PLK4 inhibitors: (E)-3-((1H-Indazol-6-yl)methylene)indolin-2-ones as novel antiproliferative agents. J Med Chem 56:6069-87 (2013)  
Target
Name:
Cytochrome P450 2C9
Synonyms:
(R)-limonene 6-monooxygenase CP2C9_HUMAN CYP2C9 Cytochrome P450 2C9 (CYP2C9 ) P-450MP P450 PB-1 | S-mephenytoin 4-hydroxylase
Type:
Enzyme
Mol. Mass.:
55636.33
Organism:
Homo sapiens (Human)
Description:
P11712
Residue:
490
  
Inhibitor
Name:
BDBM50437838
Synonyms:
CHEMBL2407749
Type:
Small organic molecule
Emp. Form.:
C23H16N4O
Mol. Mass.:
364.3993
SMILES:
O=C1Nc2ccccc2\C1=C/c1ccc2c(\C=C\c3ccncc3)n[nH]c2c1
: