Target
Metabotropic glutamate receptor 5
Ligand
BDBM50438280
Substrate
Meas. Tech.
ChEMBL_973452 (CHEMBL2410491)
IC50
4710±n/a nM
Citation
 Kubas, HMeyer, UKrueger, BHechenberger, MVanejevs, MZemribo, RKauss, VAmbartsumova, RPyatkin, IPolosukhin, AIAbel, U Discovery, synthesis, and structure-activity relationships of 2-aminoquinazoline derivatives as a novel class of metabotropic glutamate receptor 5 negative allosteric modulators. Bioorg Med Chem Lett 23:4493-500 (2013)  
Target
Name:
Metabotropic glutamate receptor 5
Synonyms:
GPRC1E GRM5_HUMAN metabotropic glutamate 5 | metabotropic glutamate 5a
Type:
Enzyme
Mol. Mass.:
132484.72
Organism:
Homo sapiens (Human)
Description:
Residue:
1212
  
Inhibitor
Name:
BDBM50438280
Synonyms:
CHEMBL2408409
Type:
Small organic molecule
Emp. Form.:
C14H14ClN3
Mol. Mass.:
259.734
SMILES:
Clc1ccc(Nc2ncc3CCCCc3n2)cc1
: