Target
Cathepsin D
Ligand
BDBM50438339
Substrate
Meas. Tech.
ChEMBL_973546 (CHEMBL2410948)
IC50
478±n/a nM
Citation
 Ng, RASun, MBowers, SHom, RKProbst, GDJohn, VFang, LYMaillard, MGailunas, ABrogley, LNeitz, RJTung, JSPleiss, MAKonradi, AWSham, HLDappen, MSAdler, MYao, NZmolek, WNakamura, DQuinn, KPSauer, JMBova, MPRuslim, LArtis, DRYednock, TA Design and synthesis of hydroxyethylamine (HEA) BACE-1 inhibitors: prime side chromane-containing inhibitors. Bioorg Med Chem Lett 23:4674-9 (2013)  
Target
Name:
Cathepsin D
Synonyms:
CATD_HUMAN CTSD Cathepsin D heavy chain Cathepsin D precursor
Type:
Enzyme
Mol. Mass.:
44551.72
Organism:
Homo sapiens (Human)
Description:
Human proCathepsin D (SwissProt accession number P07339) was expressed in Sf9 cells, purified, and autoactivated.
Residue:
412
  
Inhibitor
Name:
BDBM50438339
Synonyms:
CHEMBL2408745
Type:
Small organic molecule
Emp. Form.:
C26H32F4N2O3
Mol. Mass.:
496.5375
SMILES:
CC(=O)N[C@@H](Cc1cc(F)cc(F)c1)[C@H](O)CN[C@H]1CCOc2ccc(CC(C)(C)C(F)F)cc12
: