Target
Lysosomal alpha-glucosidase
Ligand
BDBM50438501
Substrate
Meas. Tech.
ChEMBL_976221 (CHEMBL2415870)
IC50
382200±n/a nM
Citation
 Bian, XFan, XKe, CLuan, YZhao, GZeng, A Synthesis anda-glucosidase inhibitory activity evaluation of N-substituted aminomethyl-ß-d-glucopyranosides. Bioorg Med Chem 21:5442-50 (2013)  
Target
Name:
Lysosomal alpha-glucosidase
Synonyms:
Acidic alpha-glucosidase LYAG_RAT
Type:
PROTEIN
Mol. Mass.:
106191.24
Organism:
Rattus norvegicus
Description:
ChEMBL_1506157
Residue:
953
  
Inhibitor
Name:
BDBM50438501
Synonyms:
CHEMBL2414821
Type:
Small organic molecule
Emp. Form.:
C17H23NO8
Mol. Mass.:
369.3664
SMILES:
COc1cc(\C=C\C(=O)NC[C@@H]2O[C@H](CO)[C@@H](O)[C@H](O)[C@H]2O)ccc1O
: