Target
Oligo-1,6-glucosidase IMA1
Ligand
BDBM50438501
Substrate
Meas. Tech.
ChEMBL_976222 (CHEMBL2415107)
IC50
101800±n/a nM
Citation
 Bian, XFan, XKe, CLuan, YZhao, GZeng, A Synthesis anda-glucosidase inhibitory activity evaluation of N-substituted aminomethyl-ß-d-glucopyranosides. Bioorg Med Chem 21:5442-50 (2013)  
Target
Name:
Oligo-1,6-glucosidase IMA1
Synonyms:
α-glucosidase Alpha-glucosidase (α-glucosidase) MALX3_YEAST | Oligo-1,6-glucosidase
Type:
Protein
Mol. Mass.:
68577.59
Organism:
Saccharomyces cerevisiae S288c (Baker's yeast)
Description:
Residue:
589
  
Inhibitor
Name:
BDBM50438501
Synonyms:
CHEMBL2414821
Type:
Small organic molecule
Emp. Form.:
C17H23NO8
Mol. Mass.:
369.3664
SMILES:
COc1cc(\C=C\C(=O)NC[C@@H]2O[C@H](CO)[C@@H](O)[C@H](O)[C@H]2O)ccc1O
: