Target
Histamine H1 receptor
Ligand
BDBM50438565
Substrate
Meas. Tech.
ChEMBL_977140 (CHEMBL2416698)
Ki
512±n/a nM
Citation
 Majo, VJMilak, MSPrabhakaran, JMali, PSavenkova, LSimpson, NRMann, JJParsey, RVKumar, JS Synthesis and in vivo evaluation of [(18)F]2-(4-(4-(2-(2-fluoroethoxy)phenyl)piperazin-1-yl)butyl)-4-methyl-1,2,4-triazine-3,5(2H,4H)-dione ([(18)F]FECUMI-101) as an imaging probe for 5-HT1A receptor agonist in nonhuman primates. Bioorg Med Chem 21:5598-604 (2013)  
Target
Name:
Histamine H1 receptor
Synonyms:
H1R HISTAMINE H1 HRH1_HUMAN
Type:
G Protein-Coupled Receptor (GPCR)
Mol. Mass.:
55808.72
Organism:
Homo sapiens (Human)
Description:
Cell pellets from SK-N-MC cells transfected with human H1 receptor were used in binding assay.
Residue:
487
  
Inhibitor
Name:
BDBM50438565
Synonyms:
CHEMBL2413153
Type:
Small organic molecule
Emp. Form.:
C20H28FN5O3
Mol. Mass.:
405.4664
SMILES:
Cn1c(=O)cnn(CCCCN2CCN(CC2)c2ccccc2OCCF)c1=O
: