Target
Aldo-keto reductase family 1 member C3
Ligand
BDBM50438594
Substrate
Meas. Tech.
ChEMBL_975807 (CHEMBL2415373)
IC50
4.5±n/a nM
Citation
 Watanabe, KKakefuda, AYasuda, MEnjo, KKikuchi, AFurutani, TNaritomi, YOtsuka, YOkada, MOhta, M Discovery of 2-methyl-1-{1-[(5-methyl-1H-indol-2-yl)carbonyl]piperidin-4-yl}propan-2-ol: a novel, potent and selective type 5 17ß-hydroxysteroid dehydrogenase inhibitor. Bioorg Med Chem 21:5261-70 (2013)  
Target
Name:
Aldo-keto reductase family 1 member C3
Synonyms:
17-beta-Hydroxysteroid Dehydrogenase 5 (17-beta-HSD5, AKR1C3) AK1C3_HUMAN Aldo-keto reductase family 1 member C3 Aldo-keto reductase family 1 member C3 (AK1C3a) Aldo-keto-reductase family 1 member C3 Dihydrodiol dehydrogenase 3 Estradiol 17-beta-dehydrogenase KIAA0119 Prostaglandin F synthase Trans-1,2-dihydrobenzene-1,2-diol dehydrogenase
Type:
Enzyme
Mol. Mass.:
36859.86
Organism:
Homo sapiens (Human)
Description:
P42330
Residue:
323
  
Inhibitor
Name:
BDBM50438594
Synonyms:
CHEMBL2413860
Type:
Small organic molecule
Emp. Form.:
C16H20N2O2
Mol. Mass.:
272.3422
SMILES:
OCCC1CCN(CC1)C(=O)c1cc2ccccc2[nH]1
: