Target
Nitric oxide synthase, endothelial
Ligand
BDBM50438638
Substrate
Meas. Tech.
ChEMBL_976154 (CHEMBL2415803)
Ki
979±n/a nM
Citation
 Jing, QLi, HFang, JRoman, LJMartásek, PPoulos, TLSilverman, RB In search of potent and selective inhibitors of neuronal nitric oxide synthase with more simple structures. Bioorg Med Chem 21:5323-31 (2013)  
Target
Name:
Nitric oxide synthase, endothelial
Synonyms:
Constitutive NOS Endothelial nitric oxide synthase NOS type III NOS3_BOVIN Nitric-oxide synthase, endothelial | cNOS
Type:
Enzyme
Mol. Mass.:
133292.26
Organism:
Bos taurus (bovine)
Description:
Recombinant eNOS overexpressed in E. coli was used in enzyme assays.
Residue:
1205
  
Inhibitor
Name:
BDBM50438638
Synonyms:
CHEMBL2414426
Type:
Small organic molecule
Emp. Form.:
C17H24N4
Mol. Mass.:
284.3993
SMILES:
Cc1cc(N)nc(CCCCCc2cc(C)cc(N)n2)c1
: