Target
Aldo-keto reductase family 1 member B1
Ligand
BDBM50438794
Substrate
Meas. Tech.
ChEMBL_976987 (CHEMBL2416511)
IC50
>100000±n/a nM
Citation
 Papastavrou, NChatzopoulou, MPegklidou, KNicolaou, I 1-Hydroxypyrazole as a bioisostere of the acetic acid moiety in a series of aldose reductase inhibitors. Bioorg Med Chem 21:4951-7 (2013)  
Target
Name:
Aldo-keto reductase family 1 member B1
Synonyms:
ALDR_RAT Akr1b4 Aldr1
Type:
PROTEIN
Mol. Mass.:
35797.87
Organism:
Rattus norvegicus
Description:
ChEMBL_1512484
Residue:
316
  
Inhibitor
Name:
BDBM50438794
Synonyms:
CHEMBL2413224
Type:
Small organic molecule
Emp. Form.:
C15H13N3O3
Mol. Mass.:
283.282
SMILES:
COc1ccc(cc1)C(=O)c1cccn1-c1cnn(O)c1
: