Target
Orexin receptor type 2
Ligand
BDBM50292929
Substrate
Meas. Tech.
ChEMBL_977032 (CHEMBL2416556)
Ki
8.0±n/a nM
Citation
 Lebold, TPBonaventure, PShireman, BT Selective orexin receptor antagonists. Bioorg Med Chem Lett 23:4761-9 (2013)  
Target
Name:
Orexin receptor type 2
Synonyms:
HCRTR2 OX2R_HUMAN Orexin receptor type 2 (OR-2) Orexin receptor type 2 (OX2R) Ox-2-R | Ox2-R
Type:
Protein
Mol. Mass.:
50710.53
Organism:
Homo sapiens (Human)
Description:
O43614
Residue:
444
  
Inhibitor
Name:
BDBM50292929
Synonyms:
CHEMBL455136 | almorexant
Type:
Small organic molecule
Emp. Form.:
C29H31F3N2O3
Mol. Mass.:
512.5632
SMILES:
CNC(=O)[C@H](N1CCc2cc(OC)c(OC)cc2[C@@H]1CCc1ccc(cc1)C(F)(F)F)c1ccccc1
: