Target
Nicotinamide phosphoribosyltransferase
Ligand
BDBM50438970
Substrate
Meas. Tech.
ChEMBL_978889 (CHEMBL2423680)
IC50
210±n/a nM
Citation
 Zheng, XBauer, PBaumeister, TBuckmelter, AJCaligiuri, MClodfelter, KHHan, BHo, YCKley, NLin, JReynolds, DJSharma, GSmith, CCWang, ZDragovich, PSGunzner-Toste, JLiederer, BMLy, JO'Brien, TOh, AWang, LWang, WXiao, YZak, MZhao, GYuen, PWBair, KW Structure-based discovery of novel amide-containing nicotinamide phosphoribosyltransferase (nampt) inhibitors. J Med Chem 56:6413-33 (2013)  
Target
Name:
Nicotinamide phosphoribosyltransferase
Synonyms:
NAMPT NAmPRTase Nicotinamide phosphoribosyltransferase (NAMPT) PBEF1 | Pre-B-cell colony-enhancing factor 1
Type:
Enzyme
Mol. Mass.:
55524.98
Organism:
Homo sapiens (Human)
Description:
P43490
Residue:
491
  
Inhibitor
Name:
BDBM50438970
Synonyms:
CHEMBL2420663
Type:
Small organic molecule
Emp. Form.:
C20H15N3O3S2
Mol. Mass.:
409.481
SMILES:
O=C(NCc1ccc(cc1)S(=O)(=O)c1ccccc1)c1nc2ccncc2s1
: