Target
Cytochrome P450 11B1, mitochondrial
Ligand
BDBM50438994
Substrate
Meas. Tech.
ChEMBL_979126 (CHEMBL2421741)
IC50
7099±n/a nM
Citation
 Pinto-Bazurco Mendieta, MAHu, QEngel, MHartmann, RW Highly potent and selective nonsteroidal dual inhibitors of CYP17/CYP11B2 for the treatment of prostate cancer to reduce risks of cardiovascular diseases. J Med Chem 56:6101-7 (2013)  
Target
Name:
Cytochrome P450 11B1, mitochondrial
Synonyms:
C11B1_HUMAN CYPXIB1 Cytochrome P450 11B1 Cytochrome P450 11B1, mitochondrial | S11BH
Type:
Enzyme
Mol. Mass.:
57591.44
Organism:
Homo sapiens (Human)
Description:
P15538
Residue:
503
  
Inhibitor
Name:
BDBM50438994
Synonyms:
CHEMBL2420683
Type:
Small organic molecule
Emp. Form.:
C16H12ClNO2
Mol. Mass.:
285.725
SMILES:
COc1ccc2ccc(-c3cncc(O)c3)c(Cl)c2c1
: