Target
Cytochrome P450 11B2, mitochondrial
Ligand
BDBM50438993
Substrate
Meas. Tech.
ChEMBL_979127 (CHEMBL2421742)
IC50
27±n/a nM
Citation
 Pinto-Bazurco Mendieta, MAHu, QEngel, MHartmann, RW Highly potent and selective nonsteroidal dual inhibitors of CYP17/CYP11B2 for the treatment of prostate cancer to reduce risks of cardiovascular diseases. J Med Chem 56:6101-7 (2013)  
Target
Name:
Cytochrome P450 11B2, mitochondrial
Synonyms:
Aldosterone Synthase (CYP11B2) Aldosterone-synthesizing enzyme CYP11B2 Cytochrome P450 11B2 Cytochrome P450 11B2, mitochondrial P-450C18 | Steroid 18-hydroxylase
Type:
Protein
Mol. Mass.:
57582.15
Organism:
Homo sapiens (Human)
Description:
P19099
Residue:
503
  
Inhibitor
Name:
BDBM50438993
Synonyms:
CHEMBL2420684
Type:
Small organic molecule
Emp. Form.:
C15H10ClNO2
Mol. Mass.:
271.698
SMILES:
Oc1ccc2ccc(-c3cncc(O)c3)c(Cl)c2c1
: