Target
Steroid 17-alpha-hydroxylase/17,20 lyase
Ligand
BDBM50439002
Substrate
Meas. Tech.
ChEMBL_979129 (CHEMBL2421744)
IC50
106±n/a nM
Citation
 Pinto-Bazurco Mendieta, MAHu, QEngel, MHartmann, RW Highly potent and selective nonsteroidal dual inhibitors of CYP17/CYP11B2 for the treatment of prostate cancer to reduce risks of cardiovascular diseases. J Med Chem 56:6101-7 (2013)  
Target
Name:
Steroid 17-alpha-hydroxylase/17,20 lyase
Synonyms:
CP17A_HUMAN CYP17A1 Cytochrome P450 17A1 Cytochrome P450 C17 (CYP17) Cytochrome P450-C17 P450-C17 Steroid 17-alpha-Monooxygenase (CYP17) Steroid 17-alpha-monooxygenase | cytochrome P450 monooxygenase 17 alpha hydroxylase/17,20-lyase (CYP17)
Type:
Enzyme
Mol. Mass.:
57382.42
Organism:
Homo sapiens (Human)
Description:
E.coli expressing human CYP17
Residue:
508
  
Inhibitor
Name:
BDBM50439002
Synonyms:
CHEMBL2420675
Type:
Small organic molecule
Emp. Form.:
C16H12FNO
Mol. Mass.:
253.271
SMILES:
COc1ccc2ccc(-c3cccnc3)c(F)c2c1
: