Target
Aromatase
Ligand
BDBM8904
Substrate
Meas. Tech.
ChEMBL_979123 (CHEMBL2421738)
IC50
>2000±n/a nM
Citation
 Pinto-Bazurco Mendieta, MAHu, QEngel, MHartmann, RW Highly potent and selective nonsteroidal dual inhibitors of CYP17/CYP11B2 for the treatment of prostate cancer to reduce risks of cardiovascular diseases. J Med Chem 56:6101-7 (2013)  
Target
Name:
Aromatase
Synonyms:
ARO1 CP19A_HUMAN CYP19 CYPXIX Cytochrome P450 19A1 Cytochrome P450-C19 (CYP19) FL cytokine receptor precursor | P-450AROM
Type:
Enzyme
Mol. Mass.:
57888.92
Organism:
Homo sapiens (Human)
Description:
P11511
Residue:
503
  
Inhibitor
Name:
BDBM8904
Synonyms:
3-(2-Naphthyl)pyridine CHEMBL365735 US9271963, 1
Type:
Small organic molecule
Emp. Form.:
C15H11N
Mol. Mass.:
205.2545
SMILES:
c1ccc2cc(ccc2c1)-c1cccnc1
: