Target
Cytochrome P450 11B1, mitochondrial
Ligand
BDBM50439065
Substrate
Meas. Tech.
ChEMBL_980062 (CHEMBL2423499)
IC50
427±n/a nM
Citation
 Emmerich, JHu, QHanke, NHartmann, RW Cushing's syndrome: development of highly potent and selective CYP11B1 inhibitors of the (pyridylmethyl)pyridine type. J Med Chem 56:6022-32 (2013)  
Target
Name:
Cytochrome P450 11B1, mitochondrial
Synonyms:
C11B1_HUMAN CYPXIB1 Cytochrome P450 11B1 Cytochrome P450 11B1, mitochondrial | S11BH
Type:
Enzyme
Mol. Mass.:
57591.44
Organism:
Homo sapiens (Human)
Description:
P15538
Residue:
503
  
Inhibitor
Name:
BDBM50439065
Synonyms:
CHEMBL2417638
Type:
Small organic molecule
Emp. Form.:
C18H15N3O
Mol. Mass.:
289.3312
SMILES:
NC(=O)c1cncc(Cc2ccc(nc2)-c2ccccc2)c1
: