Target
Arginase-2, mitochondrial
Ligand
BDBM50439242
Substrate
Meas. Tech.
ChEMBL_978892 (CHEMBL2423683)
IC50
85±n/a nM
Citation
 Golebiowski, AWhitehouse, DBeckett, RPVan Zandt, MJi, MKRyder, TRJagdmann, EAndreoli, MLee, YSheeler, RConway, BOlczak, JMazur, MCzestkowski, WPiotrowska, WCousido-Siah, ARuiz, FXMitschler, APodjarny, ASchroeter, H Synthesis of quaternarya-amino acid-based arginase inhibitors via the Ugi reaction. Bioorg Med Chem Lett 23:4837-41 (2013)  
Target
Name:
Arginase-2, mitochondrial
Synonyms:
ARG2 Arginase II Non-hepatic arginase | Type II arginase
Type:
PROTEIN
Mol. Mass.:
38576.93
Organism:
Homo sapiens (Human)
Description:
ChEMBL_978892
Residue:
354
  
Inhibitor
Name:
BDBM50439242
Synonyms:
CHEMBL2418828
Type:
Small organic molecule
Emp. Form.:
C13H25BN2O4
Mol. Mass.:
284.16
SMILES:
NC(CCCCB(O)O)(C1CC2CCC(C1)N2)C(O)=O
: