Target
Tumor necrosis factor receptor superfamily member 6
Ligand
BDBM50439373
Substrate
Meas. Tech.
ChEMBL_979855 (CHEMBL2422398)
EC50
2239±n/a nM
Citation
 Jung, SHSuh, JHKim, EHKim, JTYoo, SEKang, NS The discovery of inhibitors of Fas-mediated cell death pathway using the combined computational method. Bioorg Med Chem Lett 23:5155-64 (2013)  
Target
Name:
Tumor necrosis factor receptor superfamily member 6
Synonyms:
Apo-1 antigen Apt1 FASLG receptor TNR6_RAT | Tnfrsf6
Type:
PROTEIN
Mol. Mass.:
36836.00
Organism:
Rattus norvegicus
Description:
ChEMBL_107643
Residue:
324
  
Inhibitor
Name:
BDBM50439373
Synonyms:
CHEMBL2420417
Type:
Small organic molecule
Emp. Form.:
C15H12BrNO3S
Mol. Mass.:
366.23
SMILES:
OC(=O)c1ccccc1NC(=O)CSc1ccc(Br)cc1
: