Target
Tumor necrosis factor receptor superfamily member 6
Ligand
BDBM50439396
Substrate
Meas. Tech.
ChEMBL_979855 (CHEMBL2422398)
EC50
1148±n/a nM
Citation
 Jung, SHSuh, JHKim, EHKim, JTYoo, SEKang, NS The discovery of inhibitors of Fas-mediated cell death pathway using the combined computational method. Bioorg Med Chem Lett 23:5155-64 (2013)  
Target
Name:
Tumor necrosis factor receptor superfamily member 6
Synonyms:
Apo-1 antigen Apt1 FASLG receptor TNR6_RAT | Tnfrsf6
Type:
PROTEIN
Mol. Mass.:
36836.00
Organism:
Rattus norvegicus
Description:
ChEMBL_107643
Residue:
324
  
Inhibitor
Name:
BDBM50439396
Synonyms:
CHEMBL1271717
Type:
Small organic molecule
Emp. Form.:
C18H13BrClNO4S
Mol. Mass.:
454.722
SMILES:
COC(=O)c1oc2cccc(Cl)c2c1NC(=O)CSc1ccc(Br)cc1
: