Target
G protein-activated inward rectifier potassium channel 4
Ligand
BDBM95731
Substrate
Meas. Tech.
ChEMBL_980167 (CHEMBL2424001)
EC50
2200±n/a nM
Citation
 Ramos-Hunter, SJEngers, DWKaufmann, KDu, YLindsley, CWWeaver, CDSulikowski, GA Discovery and SAR of a novel series of GIRK1/2 and GIRK1/4 activators. Bioorg Med Chem Lett 23:5195-8 (2013)  
Target
Name:
G protein-activated inward rectifier potassium channel 4
Synonyms:
CIR GIRK-4 Heart KATP channel Inward rectifier K(+) channel Kir3.4 KCNJ5 Potassium channel, inwardly rectifying subfamily J member 5
Type:
PROTEIN
Mol. Mass.:
47658.06
Organism:
Homo sapiens (Human)
Description:
ChEMBL_107914
Residue:
419
  
Inhibitor
Name:
BDBM95731
Synonyms:
2-(4-chlorophenyl)-N-[3-(dimethylsulfamoyl)phenyl]acetamide MLS000374626 cid_4101833
Type:
Small organic molecule
Emp. Form.:
C16H17ClN2O3S
Mol. Mass.:
352.836
SMILES:
CN(C)S(=O)(=O)c1cccc(NC(=O)Cc2ccc(Cl)cc2)c1
: