Target
G protein-activated inward rectifier potassium channel 4
Ligand
BDBM50439410
Substrate
Meas. Tech.
ChEMBL_980171 (CHEMBL2424209)
EC50
240±n/a nM
Citation
 Ramos-Hunter, SJEngers, DWKaufmann, KDu, YLindsley, CWWeaver, CDSulikowski, GA Discovery and SAR of a novel series of GIRK1/2 and GIRK1/4 activators. Bioorg Med Chem Lett 23:5195-8 (2013)  
Target
Name:
G protein-activated inward rectifier potassium channel 4
Synonyms:
CIR GIRK-4 Heart KATP channel Inward rectifier K(+) channel Kir3.4 KCNJ5 Potassium channel, inwardly rectifying subfamily J member 5
Type:
PROTEIN
Mol. Mass.:
47658.06
Organism:
Homo sapiens (Human)
Description:
ChEMBL_107914
Residue:
419
  
Inhibitor
Name:
BDBM50439410
Synonyms:
CHEMBL2420532
Type:
Small organic molecule
Emp. Form.:
C15H10Cl2F3NO
Mol. Mass.:
348.147
SMILES:
FC(F)(F)c1cc(NC(=O)Cc2ccccc2Cl)ccc1Cl
: