Target
G protein-activated inward rectifier potassium channel 4
Ligand
BDBM50439417
Substrate
Meas. Tech.
ChEMBL_980171 (CHEMBL2424209)
EC50
>10000±n/a nM
Citation
 Ramos-Hunter, SJEngers, DWKaufmann, KDu, YLindsley, CWWeaver, CDSulikowski, GA Discovery and SAR of a novel series of GIRK1/2 and GIRK1/4 activators. Bioorg Med Chem Lett 23:5195-8 (2013)  
Target
Name:
G protein-activated inward rectifier potassium channel 4
Synonyms:
CIR GIRK-4 Heart KATP channel Inward rectifier K(+) channel Kir3.4 KCNJ5 Potassium channel, inwardly rectifying subfamily J member 5
Type:
PROTEIN
Mol. Mass.:
47658.06
Organism:
Homo sapiens (Human)
Description:
ChEMBL_107914
Residue:
419
  
Inhibitor
Name:
BDBM50439417
Synonyms:
CHEMBL2420547
Type:
Small organic molecule
Emp. Form.:
C17H18F3N3O3S
Mol. Mass.:
401.403
SMILES:
CN(C)S(=O)(=O)c1cc(NC(=O)Nc2ccc(cc2)C(F)(F)F)ccc1C
: