Target
SUMO-activating enzyme subunit 2
Ligand
BDBM50439442
Substrate
Meas. Tech.
ChEMBL_977624 (CHEMBL2423591)
IC50
14400±n/a nM
Citation
 Kumar, AIto, AHirohama, MYoshida, MZhang, KY Identification of quinazolinyloxy biaryl urea as a new class of SUMO activating enzyme 1 inhibitors. Bioorg Med Chem Lett 23:5145-9 (2013)  
Target
Name:
SUMO-activating enzyme subunit 2
Synonyms:
6.3.2.- SAE2 SUMO-activating enzyme subunit 2 UBA2 Ubiquitin-like 1-activating enzyme E1B | Ubiquitin-like modifier-activating enzyme 2
Type:
Enzyme
Mol. Mass.:
71206.17
Organism:
Homo sapiens (Human)
Description:
Q9UBT2
Residue:
640
  
Inhibitor
Name:
BDBM50439442
Synonyms:
CHEMBL2420737
Type:
Small organic molecule
Emp. Form.:
C29H28N4O2
Mol. Mass.:
464.5582
SMILES:
Cc1cccc(NC(=O)Nc2ccc(Cc3ccc(NC(=O)Nc4cccc(C)c4)cc3)cc2)c1
: