Target
Endoplasmin
Ligand
BDBM15359
Substrate
Meas. Tech.
ChEMBL_977709 (CHEMBL2424066)
IC50
31±n/a nM
Citation
 Taldone, TPatel, PDPatel, MPatel, HJEvans, CERodina, AOchiana, SShah, SKUddin, MGewirth, DChiosis, G Experimental and structural testing module to analyze paralogue-specificity and affinity in the Hsp90 inhibitors series. J Med Chem 56:6803-18 (2013)  
Target
Name:
Endoplasmin
Synonyms:
ENPL_CANLF HSP90B1 TRA1
Type:
PROTEIN
Mol. Mass.:
92464.42
Organism:
Canis familiaris
Description:
ChEMBL_1478277
Residue:
804
  
Inhibitor
Name:
BDBM15359
Synonyms:
(4E,6Z,8S,9S,10E,12S,13R,14S,16R)-13-hydroxy-8,14-dimethoxy-4,10,12,16-tetramethyl-3,20,22-trioxo-19-(prop-2-en-1-ylamino)-2-azabicyclo[16.3.1]docosa-1(21),4,6,10,18-pentaen-9-yl carbamate 17-AAG CHEMBL109480 Tanespimycin
Type:
Small organic molecule
Emp. Form.:
C31H43N3O8
Mol. Mass.:
585.6884
SMILES:
CO[C@H]1C[C@H](C)Cc2c(O)c(NC(=O)C(C)=CC=C[C@H](OC)[C@@H](OC(N)=O)\C(C)=C\[C@H](C)[C@H]1O)cc(O)c2N=CC=C
: