Target
Acetyl-CoA carboxylase 1
Ligand
BDBM50439636
Substrate
Meas. Tech.
ChEMBL_978106 (CHEMBL2422748)
IC50
13±n/a nM
Citation
 Griffith, DADow, RLHuard, KEdmonds, DJBagley, SWPolivkova, JZeng, DGarcia-Irizarry, CNSouthers, JAEsler, WAmor, PLoomis, KMcPherson, KBahnck, KBPréville, CBanks, TMoore, DEMathiowetz, AMMenhaji-Klotz, ESmith, ACDoran, SDBeebe, DADunn, MF Spirolactam-based acetyl-CoA carboxylase inhibitors: toward improved metabolic stability of a chromanone lead structure. J Med Chem 56:7110-9 (2013)  
Target
Name:
Acetyl-CoA carboxylase 1
Synonyms:
ACAC ACACA_HUMAN ACC1 Acetyl-CoA carboxylase 1 | Acetyl-CoA carboxylase 1 (ACC1)
Type:
Protein
Mol. Mass.:
265543.22
Organism:
Homo sapiens (Human)
Description:
Q13085
Residue:
2346
  
Inhibitor
Name:
BDBM50439636
Synonyms:
CHEMBL2419592 | US8993586, 85
Type:
Small organic molecule
Emp. Form.:
C23H26ClN5O2
Mol. Mass.:
439.938
SMILES:
CC(C)(C)n1cc2CC3(CCN(CC3)C(=O)c3ccc4[nH]cc(Cl)c4c3)NC(=O)c2n1
: