Target
N-acylethanolamine-hydrolyzing acid amidase
Ligand
BDBM50439662
Substrate
Meas. Tech.
ChEMBL_978417 (CHEMBL2421059)
IC50
90±n/a nM
Citation
 Ponzano, SBertozzi, FMengatto, LDionisi, MArmirotti, ARomeo, EBerteotti, AFiorelli, CTarozzo, GReggiani, ADuranti, ATarzia, GMor, MCavalli, APiomelli, DBandiera, T Synthesis and structure-activity relationship (SAR) of 2-methyl-4-oxo-3-oxetanylcarbamic acid esters, a class of potent N-acylethanolamine acid amidase (NAAA) inhibitors. J Med Chem 56:6917-34 (2013)  
Target
Name:
N-acylethanolamine-hydrolyzing acid amidase
Synonyms:
ASAH-like protein N-acylethanolamine acid amidase (NAAA) N-acylethanolamine-hydrolyzing acid amidase (NAAA) N-acylethanolamine-hydrolyzing acid amidase subunit beta NAAA_RAT | Naaa
Type:
Enzyme
Mol. Mass.:
40306.53
Organism:
Rattus norvegicus (Rat)
Description:
Q5KTC7
Residue:
362
  
Inhibitor
Name:
BDBM50439662
Synonyms:
CHEMBL2419821 | US9353075, 4
Type:
Small organic molecule
Emp. Form.:
C14H17NO4
Mol. Mass.:
263.2891
SMILES:
C[C@@H]1OC(=O)[C@@H]1NC(=O)OCCCc1ccccc1
: