Target
Ectonucleotide pyrophosphatase/phosphodiesterase family member 2
Ligand
BDBM50439704
Substrate
Meas. Tech.
ChEMBL_979383 (CHEMBL2423242)
EC50
4440±n/a nM
Citation
 Norman, DDIbezim, AScott, WEWhite, SParrill, ALBaker, DL Autotaxin inhibition: development and application of computational tools to identify site-selective lead compounds. Bioorg Med Chem 21:5548-60 (2013)  
Target
Name:
Ectonucleotide pyrophosphatase/phosphodiesterase family member 2
Synonyms:
ATX Autotaxin (ATX) ENPP2 Ectonucleotide Pyrophosphatase/Phosphodiesterase 2 (ENPP2) Extracellular lysophospholipase D PDNP2
Type:
Enzyme
Mol. Mass.:
99007.13
Organism:
Homo sapiens (Human)
Description:
Q13822
Residue:
863
  
Inhibitor
Name:
BDBM50439704
Synonyms:
CHEMBL2418934
Type:
Small organic molecule
Emp. Form.:
C37H47N5O4
Mol. Mass.:
625.8002
SMILES:
CC(O)C(NC(=O)c1ccc(nc1)N1CCC(CCCC2CCN(CC2)C(=O)Cc2ccc(cc2)-c2ccccc2)CC1)C(N)=O
: