Target
Ectonucleotide pyrophosphatase/phosphodiesterase family member 2
Ligand
BDBM50439706
Substrate
Meas. Tech.
ChEMBL_979385 (CHEMBL2423244)
Ki
800±n/a nM
Citation
 Norman, DDIbezim, AScott, WEWhite, SParrill, ALBaker, DL Autotaxin inhibition: development and application of computational tools to identify site-selective lead compounds. Bioorg Med Chem 21:5548-60 (2013)  
Target
Name:
Ectonucleotide pyrophosphatase/phosphodiesterase family member 2
Synonyms:
ATX Autotaxin (ATX) ENPP2 Ectonucleotide Pyrophosphatase/Phosphodiesterase 2 (ENPP2) Extracellular lysophospholipase D PDNP2
Type:
Enzyme
Mol. Mass.:
99007.13
Organism:
Homo sapiens (Human)
Description:
Q13822
Residue:
863
  
Inhibitor
Name:
BDBM50439706
Synonyms:
CHEMBL2418933
Type:
Small organic molecule
Emp. Form.:
C36H53N5O4
Mol. Mass.:
619.8371
SMILES:
CC(C)Cc1ccc(cc1)C(C)C(=O)N1CCC(CCCC2CCN(CC2)c2ccc(cn2)C(=O)NC(C(C)O)C(N)=O)CC1
: