Target
Ectonucleotide pyrophosphatase/phosphodiesterase family member 2
Ligand
BDBM50439709
Substrate
Meas. Tech.
ChEMBL_979385 (CHEMBL2423244)
Ki
1600±n/a nM
Citation
 Norman, DDIbezim, AScott, WEWhite, SParrill, ALBaker, DL Autotaxin inhibition: development and application of computational tools to identify site-selective lead compounds. Bioorg Med Chem 21:5548-60 (2013)  
Target
Name:
Ectonucleotide pyrophosphatase/phosphodiesterase family member 2
Synonyms:
ATX Autotaxin (ATX) ENPP2 Ectonucleotide Pyrophosphatase/Phosphodiesterase 2 (ENPP2) Extracellular lysophospholipase D PDNP2
Type:
Enzyme
Mol. Mass.:
99007.13
Organism:
Homo sapiens (Human)
Description:
Q13822
Residue:
863
  
Inhibitor
Name:
BDBM50439709
Synonyms:
CHEMBL2418931
Type:
Small organic molecule
Emp. Form.:
C27H35N5O4
Mol. Mass.:
493.5979
SMILES:
CC(C)c1ccc(OCC(=O)N2CCN(CC2C)c2ccc(cn2)C(=O)N2CCCC2C(N)=O)cc1
: