Target
NPC intracellular cholesterol transporter 1
Ligand
BDBM50439730
Substrate
Meas. Tech.
ChEMBL_979992 (CHEMBL2423075)
EC50
1600±n/a nM
Citation
 Karaki, FOhgane, KDodo, KHashimoto, Y Structure-activity relationship studies of Niemann-Pick type C1-like 1 (NPC1L1) ligands identified by screening assay monitoring pharmacological chaperone effect. Bioorg Med Chem 21:5297-309 (2013)  
Target
Name:
NPC intracellular cholesterol transporter 1
Synonyms:
NPC1 Niemann-Pick C1 protein
Type:
PROTEIN
Mol. Mass.:
142145.66
Organism:
Homo sapiens (Human)
Description:
ChEMBL_103710
Residue:
1278
  
Inhibitor
Name:
BDBM50439730
Synonyms:
CHEMBL2418982
Type:
Small organic molecule
Emp. Form.:
C31H52N2O5
Mol. Mass.:
532.755
SMILES:
C[C@H](CCC(=O)N(C)C)[C@H]1CC[C@H]2[C@@H]3CC=C4C[C@H](CC[C@]4(C)[C@H]3CC[C@]12C)OC(=O)N(CCO)CCO
: