Target
Type-1 angiotensin II receptor
Ligand
BDBM50035456
Substrate
Meas. Tech.
ChEMBL_982135 (CHEMBL2428850)
IC50
0.110000±n/a nM
Citation
  TBA Med Chem Res 0:1-17 (2013)    Article 
Target
Name:
Type-1 angiotensin II receptor
Synonyms:
AGTR1 ANGIOTENSIN AT1 Angiotensin II type 1a (AT-1a) receptor
Type:
Enzyme Catalytic Domain
Mol. Mass.:
41009.15
Organism:
RABBIT
Description:
ANGIOTENSIN AT1 AGTR1 RABBIT::P34976
Residue:
359
  
Inhibitor
Name:
BDBM50035456
Synonyms:
CHEMBL341934 | N-(3-{3-Butyl-4-[2'-(2-chloro-benzoylsulfamoyl)-biphenyl-4-ylmethyl]-5-oxo-4,5-dihydro-[1,2,4]triazol-1-yl}-4-chloro-phenyl)-butyramide
Type:
Small organic molecule
Emp. Form.:
C36H35Cl2N5O5S
Mol. Mass.:
720.665
SMILES:
CCCCc1nn(-c2cc(NC(=O)CCC)ccc2Cl)c(=O)n1Cc1ccc(cc1)-c1ccccc1S(=O)(=O)NC(=O)c1ccccc1Cl
: