Target
Glutamate receptor ionotropic, NMDA 2D
Ligand
BDBM50440056
Substrate
Meas. Tech.
ChEMBL_983632 (CHEMBL2427287)
IC50
2700±n/a nM
Citation
 Acker, TMKhatri, AVance, KMSlabber, CBacsa, JSnyder, JPTraynelis, SFLiotta, DC Structure-activity relationships and pharmacophore model of a noncompetitive pyrazoline containing class of GluN2C/GluN2D selective antagonists. J Med Chem 56:6434-56 (2013)  
Target
Name:
Glutamate receptor ionotropic, NMDA 2D
Synonyms:
GRIN2D Glutamate [NMDA] receptor subunit epsilon 4 NMDAR2D | NMDE4_HUMAN
Type:
PROTEIN
Mol. Mass.:
143780.23
Organism:
Homo sapiens (Human)
Description:
ChEMBL_983632
Residue:
1336
  
Inhibitor
Name:
BDBM50440056
Synonyms:
CHEMBL2333944
Type:
Small organic molecule
Emp. Form.:
C29H24BrN3O4
Mol. Mass.:
558.423
SMILES:
Cc1ccc2[nH]c(=O)c(C3=NN(C(C3)c3ccc(Br)cc3)C(=O)CCC(O)=O)c(-c3ccccc3)c2c1
: