Target
Glutamate receptor ionotropic, NMDA 2B
Ligand
BDBM50440064
Substrate
Meas. Tech.
ChEMBL_983747 (CHEMBL2427900)
IC50
92000±n/a nM
Citation
 Acker, TMKhatri, AVance, KMSlabber, CBacsa, JSnyder, JPTraynelis, SFLiotta, DC Structure-activity relationships and pharmacophore model of a noncompetitive pyrazoline containing class of GluN2C/GluN2D selective antagonists. J Med Chem 56:6434-56 (2013)  
Target
Name:
Glutamate receptor ionotropic, NMDA 2B
Synonyms:
GluN2B Grin2b NMDA receptor subunit N2B (GluN2B) NMDE2_RAT | NR2B
Type:
Protein
Mol. Mass.:
166077.66
Organism:
Rattus norvegicus (Rat)
Description:
Q00960
Residue:
1482
  
Inhibitor
Name:
BDBM50440064
Synonyms:
CHEMBL2426076
Type:
Small organic molecule
Emp. Form.:
C29H23ClN4O6
Mol. Mass.:
558.969
SMILES:
OC(=O)CCCC(=O)N1N=C(CC1c1ccc(cc1)[N+]([O-])=O)c1c(-c2ccccc2)c2cc(Cl)ccc2[nH]c1=O
: