Target
Metabotropic glutamate receptor 8
Ligand
BDBM50337525
Substrate
Meas. Tech.
ChEMBL_981738 (CHEMBL2426819)
EC50
>10000±n/a nM
Citation
 Bartolomé-Nebreda, JMConde-Ceide, SDelgado, FIturrino, LPastor, JPena, MÁTrabanco, AATresadern, GWassvik, CMStauffer, SRJadhav, SGogi, KVinson, PNNoetzel, MJDays, EWeaver, CDLindsley, CWNiswender, CMJones, CKConn, PJRombouts, FLavreysen, HMacdonald, GJMackie, CSteckler, T Dihydrothiazolopyridone derivatives as a novel family of positive allosteric modulators of the metabotropic glutamate 5 (mGlu5) receptor. J Med Chem 56:7243-59 (2013)  
Target
Name:
Metabotropic glutamate receptor 8
Synonyms:
GPRC1H GRM8_HUMAN Metabotropic glutamate receptor 8 | metabotropic glutamate 8
Type:
Enzyme Catalytic Domain
Mol. Mass.:
101759.58
Organism:
Homo sapiens (Human)
Description:
metabotropic glutamate 8 GRM8 HUMAN::O00222
Residue:
908
  
Inhibitor
Name:
BDBM50337525
Synonyms:
7-(phenoxymethyl)chroman-4-one | CHEMBL1682820
Type:
Small organic molecule
Emp. Form.:
C16H14O3
Mol. Mass.:
254.2806
SMILES:
O=C1CCOc2cc(COc3ccccc3)ccc12
: