Target
Metabotropic glutamate receptor 8
Ligand
BDBM50440205
Substrate
Meas. Tech.
ChEMBL_981738 (CHEMBL2426819)
EC50
>10000±n/a nM
Citation
 Bartolomé-Nebreda, JMConde-Ceide, SDelgado, FIturrino, LPastor, JPena, MÁTrabanco, AATresadern, GWassvik, CMStauffer, SRJadhav, SGogi, KVinson, PNNoetzel, MJDays, EWeaver, CDLindsley, CWNiswender, CMJones, CKConn, PJRombouts, FLavreysen, HMacdonald, GJMackie, CSteckler, T Dihydrothiazolopyridone derivatives as a novel family of positive allosteric modulators of the metabotropic glutamate 5 (mGlu5) receptor. J Med Chem 56:7243-59 (2013)  
Target
Name:
Metabotropic glutamate receptor 8
Synonyms:
GPRC1H GRM8_HUMAN Metabotropic glutamate receptor 8 | metabotropic glutamate 8
Type:
Enzyme Catalytic Domain
Mol. Mass.:
101759.58
Organism:
Homo sapiens (Human)
Description:
metabotropic glutamate 8 GRM8 HUMAN::O00222
Residue:
908
  
Inhibitor
Name:
BDBM50440205
Synonyms:
CHEMBL2426621
Type:
Small organic molecule
Emp. Form.:
C15H11NOS
Mol. Mass.:
253.319
SMILES:
O=C1CCCc2nc(sc12)C#Cc1ccccc1
: