Target
Mineralocorticoid receptor
Ligand
BDBM50440243
Substrate
Meas. Tech.
ChEMBL_981999 (CHEMBL2428203)
EC50
>5000000±n/a nM
Citation
 Sheppeck, JEGilmore, JLXiao, HYDhar, TGNirschl, DDoweyko, AMSack, JSCorbett, MJMalley, MFGougoutas, JZMckay, LCunningham, MDHabte, SFDodd, JHNadler, SGSomerville, JEBarrish, JC Discovery of potent and selective nonsteroidal indazolyl amide glucocorticoid receptor agonists. Bioorg Med Chem Lett 23:5442-7 (2013)  
Target
Name:
Mineralocorticoid receptor
Synonyms:
MCR MLR NR3C2 | Nuclear receptor subfamily 3 group C member 2
Type:
Enzyme
Mol. Mass.:
107076.42
Organism:
Homo sapiens (Human)
Description:
P08235
Residue:
984
  
Inhibitor
Name:
BDBM50440243
Synonyms:
CHEMBL2426662
Type:
Small organic molecule
Emp. Form.:
C26H22FN5OS
Mol. Mass.:
471.549
SMILES:
CC(C)([C@@H](c1ccccc1)c1ccc2n(ncc2c1)-c1ccc(F)cc1)C(=O)Nc1nncs1
: