Target
Telomerase reverse transcriptase
Ligand
BDBM50440391
Substrate
Meas. Tech.
ChEMBL_980998 (CHEMBL2427719)
IC50
28±n/a nM
Citation
 Artese, ACosta, GDistinto, SMoraca, FOrtuso, FParrotta, LAlcaro, S Toward the design of new DNA G-quadruplex ligands through rational analysis of polymorphism and binding data. Eur J Med Chem 68:139-49 (2013)  
Target
Name:
Telomerase reverse transcriptase
Synonyms:
EST2 TERT TRT
Type:
PROTEIN
Mol. Mass.:
127099.03
Organism:
Homo sapiens (Human)
Description:
ChEMBL_1447029
Residue:
1132
  
Inhibitor
Name:
BDBM50440391
Synonyms:
CHEMBL2425367
Type:
Small organic molecule
Emp. Form.:
C32H40N6
Mol. Mass.:
508.7002
SMILES:
CN(C)CCCNCc1ccc2nc3c(ccc4nc5ccc(CNCCCN(C)C)cc5cc34)cc2c1
: