Target
Transient receptor potential cation channel subfamily V member 1
Ligand
BDBM50305278
Substrate
Meas. Tech.
ChEMBL_982056 (CHEMBL2428531)
Ki
5.9±n/a nM
Citation
 Lim, KSLee, HKim, SEHa, THAnn, JSon, KChoi, SSun, WPearce, LVDeAndrea-Lazarus, IABlumberg, PMLee, J The carbonate analogues of 5'-halogenated resiniferatoxin as TRPV1 ligands. Eur J Med Chem 68:233-43 (2013)  
Target
Name:
Transient receptor potential cation channel subfamily V member 1
Synonyms:
Capsaicin receptor Osm-9-like TRP channel 1 TRPV1_HUMAN Transient receptor potential cation channel subfamily V member 1 (TRPV1) Transient receptor potential cation channel subfamily V member 1(TRPV1) Vanilloid VR1 Vanilloid receptor 1 Vanilloid receptor 1 (VRI/TRPV1)
Type:
Protein
Mol. Mass.:
94960.75
Organism:
Homo sapiens (Human)
Description:
Q8NER1
Residue:
839
  
Inhibitor
Name:
BDBM50305278
Synonyms:
CHEMBL595069 | iodoresiniferatoxin
Type:
Small organic molecule
Emp. Form.:
C37H39IO9
Mol. Mass.:
754.6046
SMILES:
COc1cc(CC(=O)OCC2=C[C@H]3[C@H]4O[C@]5(Cc6ccccc6)O[C@]4(C[C@@H](C)[C@]3(O5)[C@@H]3C=C(C)C(=O)[C@@]3(O)C2)C(C)=C)cc(I)c1O
: