Target
PHD finger protein 23
Ligand
BDBM50440568
Substrate
Meas. Tech.
ChEMBL_983401 (CHEMBL2429071)
IC50
>10000±n/a nM
Citation
 James, LIKorboukh, VKKrichevsky, LBaughman, BMHerold, JMNorris, JLJin, JKireev, DBJanzen, WPArrowsmith, CHFrye, SV Small-molecule ligands of methyl-lysine binding proteins: optimization of selectivity for L3MBTL3. J Med Chem 56:7358-71 (2013)  
Target
Name:
PHD finger protein 23
Synonyms:
PDH-containing protein JUNE-1 PHD finger protein 23 (PHF23) PHF23_HUMAN
Type:
Protein
Mol. Mass.:
43813.67
Organism:
Homo sapiens (Human)
Description:
Residue:
403
  
Inhibitor
Name:
BDBM50440568
Synonyms:
CHEMBL2426476
Type:
Small organic molecule
Emp. Form.:
C26H37BrN4O2
Mol. Mass.:
517.502
SMILES:
Brc1cc(ccc1C(=O)N1CCC(CC1)N1CCCC1)C(=O)N1CCC(CC1)N1CCCC1
: