Target
Isoform 4 of Lethal(3)malignant brain tumor-like protein 1 (4)
Ligand
BDBM50440566
Substrate
Meas. Tech.
ChEMBL_983408 (CHEMBL2429078)
IC50
6800±n/a nM
Citation
 James, LIKorboukh, VKKrichevsky, LBaughman, BMHerold, JMNorris, JLJin, JKireev, DBJanzen, WPArrowsmith, CHFrye, SV Small-molecule ligands of methyl-lysine binding proteins: optimization of selectivity for L3MBTL3. J Med Chem 56:7358-71 (2013)  
Target
Name:
Isoform 4 of Lethal(3)malignant brain tumor-like protein 1 (4)
Synonyms:
H-l(3)mbt KIAA0681 L(3)mbt-like L3MBTL LMBL1_HUMAN Lethal(3)malignant brain tumor-like protein 1 (4) | Lethal(3)malignant brain tumor-like protein 1 (L3MBTL1)
Type:
Protein
Mol. Mass.:
83871.06
Organism:
Homo sapiens (Human)
Description:
Q9Y468-4
Residue:
752
  
Inhibitor
Name:
BDBM50440566
Synonyms:
CHEMBL2426478
Type:
Small organic molecule
Emp. Form.:
C26H39N5O2
Mol. Mass.:
453.6202
SMILES:
Nc1cc(ccc1C(=O)N1CCC(CC1)N1CCCC1)C(=O)N1CCC(CC1)N1CCCC1
: