Target
Lethal(3)malignant brain tumor-like protein 4
Ligand
BDBM50440613
Substrate
Meas. Tech.
ChEMBL_983407 (CHEMBL2429077)
IC50
>10000±n/a nM
Citation
 James, LIKorboukh, VKKrichevsky, LBaughman, BMHerold, JMNorris, JLJin, JKireev, DBJanzen, WPArrowsmith, CHFrye, SV Small-molecule ligands of methyl-lysine binding proteins: optimization of selectivity for L3MBTL3. J Med Chem 56:7358-71 (2013)  
Target
Name:
Lethal(3)malignant brain tumor-like protein 4
Synonyms:
H-l(3)mbt-like protein 4 L3MBTL4 | LMBL4_HUMAN
Type:
PROTEIN
Mol. Mass.:
71132.81
Organism:
Homo sapiens (Human)
Description:
ChEMBL_983407
Residue:
623
  
Inhibitor
Name:
BDBM50440613
Synonyms:
CHEMBL2426365
Type:
Small organic molecule
Emp. Form.:
C33H45N5O2
Mol. Mass.:
543.7427
SMILES:
O=C(N1CCC(CC1)N1CCCC1)c1ccc(C(=O)N2CCC(CC2)N2CCCC2)c(NCc2ccccc2)c1
: