Target
Lethal(3)malignant brain tumor-like protein 4
Ligand
BDBM50440596
Substrate
Meas. Tech.
ChEMBL_983407 (CHEMBL2429077)
IC50
>10000±n/a nM
Citation
 James, LIKorboukh, VKKrichevsky, LBaughman, BMHerold, JMNorris, JLJin, JKireev, DBJanzen, WPArrowsmith, CHFrye, SV Small-molecule ligands of methyl-lysine binding proteins: optimization of selectivity for L3MBTL3. J Med Chem 56:7358-71 (2013)  
Target
Name:
Lethal(3)malignant brain tumor-like protein 4
Synonyms:
H-l(3)mbt-like protein 4 L3MBTL4 | LMBL4_HUMAN
Type:
PROTEIN
Mol. Mass.:
71132.81
Organism:
Homo sapiens (Human)
Description:
ChEMBL_983407
Residue:
623
  
Inhibitor
Name:
BDBM50440596
Synonyms:
CHEMBL2426485
Type:
Small organic molecule
Emp. Form.:
C28H42N4O2
Mol. Mass.:
466.6587
SMILES:
O=C(N1CCC(CC1)N1CCCC1)c1ccc(cc1)C(=O)N1CCC(CC1)N1CCCCCC1
: