Target
MBT domain-containing protein 1
Ligand
BDBM50440606
Substrate
Meas. Tech.
ChEMBL_983404 (CHEMBL2429074)
IC50
3500±n/a nM
Citation
 James, LIKorboukh, VKKrichevsky, LBaughman, BMHerold, JMNorris, JLJin, JKireev, DBJanzen, WPArrowsmith, CHFrye, SV Small-molecule ligands of methyl-lysine binding proteins: optimization of selectivity for L3MBTL3. J Med Chem 56:7358-71 (2013)  
Target
Name:
MBT domain-containing protein 1
Synonyms:
MBT domain-containing protein 1 MBTD1 | MBTD1_HUMAN
Type:
Protein
Mol. Mass.:
70557.67
Organism:
Homo sapiens (Human)
Description:
Residue:
628
  
Inhibitor
Name:
BDBM50440606
Synonyms:
CHEMBL2426376
Type:
Small organic molecule
Emp. Form.:
C33H39N5O2
Mol. Mass.:
537.6951
SMILES:
CCN1Cc2ccc(NC(=O)c3ccc(cc3Nc3ccccc3)C(=O)N3CCC(CC3)C3CCCN3)cc2C1
: